{"text_format":"1","workbook":"xlsx","n_sheets":12,"sheets":["Summary Details","Detailed Description","Version History","Enquiry","Affordability Calculator","Mortgage Repayments (UW)","Mortgage Repayments (E)","Data","Council tax","Postcodes","E Calc","Tax Calculator"],"not_rendered":{"charts":0,"images":2,"macros":1,"external_links":2,"defined_names":47,"comments":0,"pivot_tables":1},"unopened":[],"bounds":{"document_bytes":16777216,"sheet_cells":100000,"rows_first":2000,"rows_last":500,"rows_between":2000,"halvings":0,"cell_chars":16384,"cell_head_chars":4096},"cells_cut":0,"cells_raw":0,"read":"whole","date_system":"1900"}

{"sheet":"Summary Details","index":0,"n_rows":20,"n_cols":3,"rows_kept":20,"cut":false,"hidden":true,"merged":[[3,0,3,2]]}
["HRBS Affordability Calculator - Owner Occupier"]
["Summary Details"]
[]
["This model has been identified as a material model, as defined in the Model Risk Management Policy, and therefore follows the requirements of that Policy, as follows:\n\n- Summary Details, Detailed Description and Version Control tabs are included in the spreadsheet and kept up-to-date;\n- Write access to the spreadsheet is password protected;\n- A minimum of 2 staff members are trained on how to use the model and are able to make amendments;\n- All output from the model is subject to review by an independent person (cannot be the preparer); and\n- Changes to the model are subject to review by an independent person (cannot be the person making changes).\n"]
[]
["Model name:",null,"Affordability Calculator"]
[]
["Purpose of the model:",null,"This is the Society's affordability calculator used to understand how much customers are able to borrow based on set criteria and affordability.  "]
[]
["Model Owner:",null,"Director of Lending"]
[]
["Locations:",null,"F:\\Shared reports\\Calculators\\Owner Occupied"]
[]
["Staff trained on use / changes (main two):",null,"Finance Analyst - Product Pricing, Finance Manager - MI"]
[]
{"$rows_left_out":6}
{"sheet":"Detailed Description","index":1,"n_rows":37,"n_cols":1,"rows_kept":37,"cut":false,"hidden":true,"merged":[]}
[{"$f":"'Summary Details'!A1","v":"HRBS Affordability Calculator - Owner Occupier"}]
["Detailed Description"]
[]
["Detailed description:"]
["This is the Society's affordability calculator used when assessing affordability for owner occupier loan applications, affordability is assessed using a net free pay calculation (5% minimum required to pass) using actual income and expenditure input into the model. Expenditure is compared against ONS per the applicants specific region and household occupancy and any expenditure which is less than or equal to 105% of ONS is flagged. The loan monthly payment is calculated per input criteria and stressed using the stress rate applicable to the product length. The maximum loan available to the customer is calculated depending on the individuals income, credit history."]
[]
["How to use the model (if separate procedures are in place then just link to these):"]
[]
[]
[]
[]
[]
["How the model works:"]
["ONS expenditure data is stored on the \"Data\" tab, using the postcode input into the model the region is found using the lookup table in the postcode summary tab, this region is then used to find the expenditure specific to that region on the ONS data tab, this is then multiplied by a weighting on the data tab, the weighting used is determined by the household occupancy input into the model. ONS expenditure is compared with actuals on the main sheet and flagged where actuals are less than or equal to 105%.\n\nMortgage repayments are calculated on their own tab, using inputs from the calculator, this sheet is also where stress rates are updated when changed.\n\n"]
[]
{"$rows_left_out":23}
{"sheet":"Version History","index":2,"n_rows":54,"n_cols":4,"rows_kept":54,"cut":false,"hidden":true,"merged":[[42,0,45,0],[42,3,45,3]]}
["Date","Change History","Tab","Version Number"]
["2020-03-10","Added MPI Exclusive Criteria regarding LTI's and Max Loans","UW"]
["2020-04-16","Updated ONS/ Stress Rates","UW"]
["2020-06-12","Wording Row 19 \"Does lending criteria allow higher income multiples to be used?\"; Wales council tax aligned with grand total row","UW"]
["2021-11-16","LTI and advance limits adjusted","UW"]
["2022-01-12","Updated Stress Rates","UW"]
["2022-02-28","Updated Stress Rates","UW"]
["2022-07-12","Professionals change; Stress rates; ONS","UW"]
["2022-09-21","Updated Stress Rates","UW"]
["2022-10-14","Updated Stress Rates","UW"]
["2022-11-11","Updated Stress Rates","UW"]
["2023-01-17","Updated Stress Rates","UW"]
["2023-03-02","Changed stress from +3% to +1%","UW"]
["2023-06-30","Updated stress rates","UW"]
["2023-07-19","Updated stress rates","UW"]
{"$rows_left_out":40}
{"sheet":"Enquiry","index":3,"n_rows":128,"n_cols":29,"rows_kept":128,"cut":false,"hidden":true,"merged":[[41,28,41,34],[45,17,45,18],[45,20,45,22],[48,17,48,18],[48,20,48,22],[51,17,51,18],[51,20,51,22],[54,17,54,18],[54,20,54,22],[44,17,44,18],[47,17,47,18],[50,17,50,18],[53,17,53,18],[79,5,79,7],[79,10,79,12],[79,15,79,17],[79,20,79,22],[86,18,86,22],[85,21,85,22],[97,29,97,31],[106,18,106,20],[108,6,108,8],[108,18,108,20],[95,6,95,8],[95,18,95,20],[96,6,96,8],[96,18,96,20],[97,6,97,8],[107,18,107,20],[97,18,97,20],[102,18,102,20],[103,6,103,8],[103,18,103,20],[104,18,104,20],[98,29,98,31],[96,29,96,31],[82,10,82,12],[91,27,91,28],[84,0,86,0],[85,8,85,10],[85,14,85,16],[86,14,86,16],[89,6,89,8],[90,18,90,20],[91,6,91,8],[91,18,91,20],[86,8,86,10],[89,18,89,20],[88,18,88,20],[88,0,111,0],[106,1,111,1],[109,6,109,8],[109,18,109,20],[110,18,110,20],[90,6,90,8],[107,6,107,8],[94,18,94,20],[92,18,92,20],[0,19,0,21],[1,4,1,13],[58,20,58,22],[59,14,59,16],[49,4,49,13],[45,8,45,10],[38,10,38,22],[35,17,35,19],[100,1,105,1],[100,18,100,20],[101,6,101,8],[101,18,101,20],[102,6,102,8],[68,6,68,8],[68,10,68,12],[68,14,68,16],[48,8,48,10],[51,8,51,10],[54,8,54,10],[49,17,49,18],[50,4,50,7],[57,14,57,16],[2,19,2,22],[19,4,19,10],[21,4,21,11],[21,13,21,15],[3,0,9,22],[56,0,70,0],[58,6,58,8],[57,6,57,8],[59,6,59,8],[38,4,38,6],[32,4,32,6],[31,4,31,6],[31,12,31,14],[32,12,32,14],[29,0,33,0],[27,7,27,21],[37,4,37,6],[33,12,33,14],[31,16,31,18],[10,0,16,0],[21,0,24,0],[18,0,20,0],[23,8,23,22],[19,14,19,22],[10,4,10,5],[17,0,17,3],[17,4,17,7],[17,8,17,9],[17,10,17,22],[12,4,12,5],[13,4,13,5],[14,4,14,5],[15,4,15,5],[16,4,16,5],[18,4,18,11],[120,0,123,22],[114,0,118,0],[114,1,118,22],[119,20,119,22],[112,0,113,1],[112,2,113,3],[60,6,60,8],[60,10,60,12],[73,9,73,22],[62,20,62,22],[61,6,61,8],[60,14,60,16],[60,20,60,22],[63,20,63,22],[64,14,64,16],[64,20,64,22],[71,0,77,0],[61,14,61,16],[74,4,74,6],[74,9,74,22],[88,1,93,1],[94,1,99,1],[75,4,75,6],[98,18,98,20],[119,9,119,17],[112,17,113,17],[112,20,113,22],[4,23,4,24],[43,0,55,0],[56,6,56,22],[35,4,35,6],[35,10,35,12],[112,4,113,4],[112,5,113,6],[112,7,113,8],[112,9,113,11],[112,12,113,14],[112,18,113,19],[112,15,113,16],[67,20,67,22],[64,6,64,8],[64,10,64,12],[62,14,62,16],[18,12,18,13],[11,4,11,5],[73,4,73,6],[61,20,61,22],[22,4,22,22],[70,3,70,22],[58,24,59,26],[57,10,57,12],[65,10,65,12],[65,14,65,16],[65,20,65,22],[59,10,59,12],[58,14,58,16],[58,10,58,12],[59,20,59,22],[67,24,67,25],[61,24,61,25],[63,24,63,25],[65,24,65,25],[63,6,63,8],[37,10,37,15],[36,10,36,12],[36,4,36,6],[33,4,33,6],[63,14,63,16],[18,14,18,22],[82,15,82,17],[82,20,82,22],[43,4,43,13],[44,4,44,7],[46,4,46,13],[46,17,46,18],[43,17,43,18],[52,4,52,13],[47,4,47,7],[75,9,75,22],[76,4,76,6],[76,9,76,22],[61,10,61,12],[69,14,69,16],[63,10,63,12],[62,6,62,8],[62,10,62,12],[52,17,52,18],[53,4,53,7],[66,14,66,16],[69,6,69,8],[69,10,69,12],[67,6,67,8],[39,3,39,22],[65,6,65,8],[68,20,68,22],[66,20,66,22],[69,20,69,22],[66,6,66,8],[66,10,66,12],[67,10,67,12],[67,14,67,16],[78,0,80,0],[81,0,83,0],[78,5,78,7],[78,10,78,12],[78,15,78,17],[78,20,78,22],[25,0,27,0],[26,4,26,22],[30,4,30,6],[31,8,31,10],[32,8,32,10],[33,8,33,10],[41,0,41,22],[82,5,82,7],[35,0,39,0],[37,19,37,20],[36,15,36,20],[32,16,32,18],[33,16,33,18],[30,8,30,10],[30,12,30,14],[30,16,30,18],[29,4,29,6],[25,21,25,22]]}
[null,"Owner Occupier Referral Form"]
[null,"Product Range:"]
[null,"Reason for referral /area of non-compliance:",null,null,null,null,null,null,null,null,null,null,null,null,null,null,null,null,"Date:"]
[]
[null,null,null,null,null,null,null,null,null,null,null,null,null,null,null,null,null,null,null,null,null,null,null,"Pillars"]
[null,null,null,null,null,null,null,null,null,null,null,null,null,null,null,null,null,null,null,null,null,null,null,"LTV:",{"$f":"IFERROR(E36/K36,\"\")","v":""}]
[null,null,null,null,null,null,null,null,null,null,null,null,null,null,null,null,null,null,null,null,null,null,null,"LTI:",{"$f":"F113","v":""}]
[null,null,null,null,null,null,null,null,null,null,null,null,null,null,null,null,null,null,null,null,null,null,null,"Credit:",{"$f":"E24","v":0}]
[null,null,null,null,null,null,null,null,null,null,null,null,null,null,null,null,null,null,null,null,null,null,null,"Afford:",{"$f":"J113","v":"Incomplete"}]
[null,null,null,null,null,null,null,null,null,null,null,null,null,null,null,null,null,null,null,null,null,null,null,"Prop:"]
["Self Build Only",null,null,"Loan required:",{"$f":"E36","v":0}]
[null,null,null,"PP/land value:"]
[null,null,null,"Build Costs:"]
[null,null,null,"Customer Contribution:"]
[null,null,null,"Loan to Cost:",{"$f":"IFERROR(E11/(E12+E13),\"\")","v":""}]
{"$rows_left_out":114}
{"sheet":"Affordability Calculator","index":4,"n_rows":94,"n_cols":26,"rows_kept":94,"cut":false,"hidden":false,"merged":[[92,1,92,3],[92,4,92,7],[86,25,87,25],[62,24,62,25],[91,1,91,3],[91,4,91,7],[1,1,1,8],[85,6,86,7],[35,3,35,5],[33,3,33,5],[85,3,86,5],[41,3,41,5],[37,3,37,5],[1,17,9,18],[93,1,97,6],[24,15,25,15],[47,23,48,23],[45,23,46,25],[6,2,6,6],[47,25,48,25],[47,24,48,24],[24,3,25,3],[24,7,25,7],[24,11,25,11],[48,19,48,22],[7,21,7,26],[72,24,72,25],[50,24,50,25],[86,24,87,24]]}
[]
[null,"Affordability Assessment "]
[null,null,null,null,null,null,null,null,null,null,null,null,null,null,"Input"]
[null,null,null,null,null,null,null,null,null,null,null,null,null,null,"Dropdown"]
[null,"Date"]
[]
[null,"Type of application","House purchase"]
[null,null,null,null,null,null,null,null,null,null,null,null,null,null,null,null,null,null,null,null,null,"LTI CALCULATION"]
[null,"Households being maintained"]
[null,null,null,null,null,null,null,null,null,null,null,null,null,null,null,null,null,null,null,null,null,null,null,"Income","LTI"]
[null,"Postcode",null,null,null,null,null,null,null,null,null,null,null,null,null,null,null,null,null,null,null,null,"APP1",{"$f":"$C$27-($C$30*12)-($C$32*12)","v":0},{"$f":"$C$23","v":0},{"$f":"Y11*X11","v":0}]
[null,null,null,null,null,null,null,null,null,null,null,null,null,null,null,null,null,null,null,null,null,null,"APP2",{"$f":"$G$27-($G$30*12)-($G$32*12)","v":0},{"$f":"$G$23","v":0},{"$f":"Y12*X12","v":0}]
[null,"Region",{"$f":"_xlfn.IFNA(VLOOKUP(LEFT(C11, 2), Postcodes!$A$1:$B$9486, 2, FALSE),\"\")","v":""},null,null,null,{"$f":"_xlfn.IFNA(VLOOKUP(LEFT(G11, 2), Postcodes!$A$1:$B$9486, 2, FALSE),\"\")","v":""},null,null,null,{"$f":"_xlfn.IFNA(VLOOKUP(LEFT(K11, 2), Postcodes!$A$1:$B$9486, 2, FALSE),\"\")","v":""},null,null,null,{"$f":"_xlfn.IFNA(VLOOKUP(LEFT(O11, 2), Postcodes!$A$1:$B$9486, 2, FALSE),\"\")","v":""},null,null,null,null,null,null,null,"APP3",{"$f":"$K$27-($K$30*12)-($K$32*12)","v":0},{"$f":"$K$23","v":0},0]
[null,null,null,null,null,null,null,null,null,null,null,null,null,null,null,null,null,null,null,null,null,null,"APP4",{"$f":"$O$27-($O$30*12)-($O$32*12)","v":0},{"$f":"$O$23","v":0},0]
[null,"Occupancy"]
{"$rows_left_out":80}
{"sheet":"Mortgage Repayments (UW)","index":5,"n_rows":27,"n_cols":15,"rows_kept":27,"cut":false,"hidden":true,"merged":[[1,1,1,5],[1,6,1,10]]}
[]
[null,"STANDARD RATE",null,null,null,null,"STRESSED RATE"]
[]
[null,"Monthly repayment",null,null,{"$f":"VLOOKUP('Affordability Calculator'!$C$42, 'Mortgage Repayments (UW)'!$M$5:$N$7, 2, FALSE)","v":{"$error":"#N/A"}},null,"Monthly repayment",null,null,{"$f":"VLOOKUP('Affordability Calculator'!$C$42, 'Mortgage Repayments (UW)'!$M$5:$O$7, 3, FALSE)","v":{"$error":"#N/A"}}]
[null,null,null,null,null,null,null,null,null,null,null,null,"capital repayment",{"$f":"E18","v":{"$error":"#NUM!"}},{"$f":"J18","v":{"$error":"#N/A"}}]
[null,null,null,null,null,null,null,null,null,null,null,null,"interest only",{"$f":"E24","v":0},{"$f":"J24","v":{"$error":"#N/A"}}]
[null,null,null,null,null,null,null,null,null,null,null,null,"Part capital repayment/Part interest only",{"$f":"E27","v":{"$error":"#NUM!"}},{"$f":"J27","v":{"$error":"#N/A"}}]
[null,"Capital Repayment",null,null,null,null,"Capital Repayment"]
[]
[null,null,"Mortgage amount",null,{"$f":"'Affordability Calculator'!C44","v":0},null,null,"Mortgage amount",null,{"$f":"'Affordability Calculator'!C44","v":0},null,null,"Less than 5 years",7.8899999999999998E-2]
[null,null,null,null,null,null,null,null,null,null,null,null,"5 years",{"$f":"E15","v":0},"no stress required"]
[null,null,"Term",null,{"$f":"'Affordability Calculator'!$C$40","v":0},"Years",null,"Term",null,{"$f":"'Affordability Calculator'!$C$40","v":0},"Years",null,"Lifetime",{"$f":"E15+1%","v":0.01}]
[null,null,null,null,{"$f":"E12*12","v":0},"Months",null,null,null,{"$f":"J12*12","v":0},"Months"]
[]
[null,null,"Interest Rate (APR)",null,{"$f":"TALO6","v":0},"%",null,"Interest Rate (APR)",null,{"$f":"VLOOKUP('Affordability Calculator'!C49, 'Mortgage Repayments (UW)'!M10:N12, 2, FALSE)","v":{"$error":"#N/A"}},"%"]
{"$rows_left_out":13}
{"sheet":"Mortgage Repayments (E)","index":6,"n_rows":27,"n_cols":15,"rows_kept":27,"cut":false,"hidden":true,"merged":[[1,1,1,5],[1,6,1,10]]}
[]
[null,"STANDARD RATE",null,null,null,null,"STRESSED RATE"]
[]
[null,"Monthly repayment",null,null,{"$f":"VLOOKUP('E Calc'!D9, 'Mortgage Repayments (E)'!$M$5:$O$7, 2, FALSE)","v":{"$error":"#NUM!"}},null,"Monthly repayment",null,null,{"$f":"VLOOKUP('E Calc'!D9, 'Mortgage Repayments (E)'!$M$5:$O$7, 3, FALSE)","v":{"$error":"#N/A"}},null,null,null,"Standard","Stressed"]
[null,null,null,null,null,null,null,null,null,null,null,null,"Capital Repayment",{"$f":"E18","v":{"$error":"#NUM!"}},{"$f":"J18","v":{"$error":"#N/A"}}]
[null,null,null,null,null,null,null,null,null,null,null,null,"Interest Only",{"$f":"E24","v":0},{"$f":"J24","v":{"$error":"#N/A"}}]
[null,null,null,null,null,null,null,null,null,null,null,null,"Part capital repayment/Part interest only",{"$f":"E27","v":{"$error":"#NUM!"}},{"$f":"J27","v":{"$error":"#N/A"}}]
[null,"Capital Repayment",null,null,null,null,"Capital Repayment"]
[]
[null,null,"Mortgage amount",null,{"$f":"J10","v":0},null,null,"Mortgage amount",null,{"$f":"'E Calc'!D11","v":0},null,null,"5 year Fixed",{"$f":"'E Calc'!D17","v":0},"no stress required"]
[null,null,null,null,null,null,null,null,null,null,null,null,"Lifetime Discount/Tracker",{"$f":"'E Calc'!D17+1%","v":0.01}]
[null,null,"Term",null,{"$f":"J12","v":0},"Years",null,"Term",null,{"$f":"'E Calc'!D7","v":0},"Years",null,"Other (all 2 & 3 year products)",{"$f":"'Mortgage Repayments (UW)'!$N$10","v":7.8899999999999998E-2}]
[null,null,null,null,{"$f":"E12*12","v":0},"Months",null,null,null,{"$f":"J12*12","v":0},"Months",null,"Self-Build"]
[]
[null,null,"Interest Rate (APR)",null,{"$f":"Enquiry!T38","v":0},"%",null,"Interest Rate (APR)",null,{"$f":"VLOOKUP('E Calc'!D15, 'Mortgage Repayments (E)'!M10:N13, 2, FALSE)","v":{"$error":"#N/A"}},"%"]
{"$rows_left_out":13}
{"sheet":"Data","index":7,"n_rows":66,"n_cols":18,"rows_kept":66,"cut":false,"hidden":true,"merged":[]}
[]
[null,null,"2023 DATA"]
[null,1,"ONS Table A33/A35 Monthly expenditure","North East","North West","Yorkshire & the Humber","East Midlands","West Midlands","East England","London","South East","South West","Wales","Scotland",null,null,null,"Standard Resi (No MRC)"]
[null,2,null,null,null,null,null,null,null,null,null,null,null,null,null,null,null,"Standard BTL (No MRC)"]
[null,3,null,null,null,null,null,null,null,null,null,null,null,null,null,null,null,"Credit Flex"]
[null,4,"Clothing & footwear",59.145190000000007,72.689890000000005,58.242210000000007,69.52946,69.077970000000022,65.917539999999988,79.010750000000002,66.820520000000016,69.52946,65.917539999999988,62.30561999999999,null,null,null,"Specialist Resi (MRC Referral)"]
[null,5,"Communication",84.428629999999998,95.715879999999999,86.686080000000004,93.909920000000014,93.458429999999993,101.13376,93.00694,97.070350000000005,96.618860000000012,91.652470000000022,93.909920000000014,null,null,null,"BTL Specialist (MRC Referral)"]
[null,6,"Education",null,null,null,null,null,null,null,null,null,null,null,null,null,null,"JBSP"]
[null,7,"Food & non-alcoholic drinks",250.12545999999998,288.50211000000002,266.83059000000003,292.11403000000001,283.98721,306.11022000000003,305.65873000000005,320.10641000000004,296.62893000000003,281.27826999999996,274.95740999999998,null,null,null,"Income Flex"]
[null,8,"Health",20.317050000000002,35.21622,36.570690000000006,37.925159999999998,46.50347,35.21622,37.022179999999999,46.05198,35.66771,30.249830000000003,29.79834,null,null,null,"BTL JBSP"]
[null,9,"Household goods & services",145.37978000000001,139.96190000000001,158.92448000000002,142.21935000000002,134.54402000000002,153.95809,145.37978000000001,162.53640000000001,158.47299000000001,125.06272999999999,139.96190000000001,null,null,null,"BTL Non Owner"]
[null,10,"Housing (net), fuel & power",181.95047,218.06967,210.84583000000001,207.68540000000002,215.36073000000002,232.96884000000003,230.71138999999999,246.51354000000001,231.61436999999998,218.52116000000004,211.74880999999999,null,null,null,"BTL Top Slicing"]
[null,11,"Miscellaneous goods and services",92.103960000000001,128.22316000000001,114.67845999999999,117.38740000000003,125.06272999999999,130.02912000000001,138.15593999999999,140.41338999999999,123.25677000000002,112.42101000000002,110.16355999999998,null,null,null,"Ex-Pat"]
[null,12,"Transport",158.0215,186.01388,179.69302000000005,191.43176,171.11471000000003,205.42794999999998,152.15213,236.12926999999999,203.17050000000003,178.79004,181.95047,null,null,null,"LTD Company"]
[null,null,null,null,null,null,null,null,null,null,null,null,null,null,null,null,null,"Green Further Advance"]
{"$rows_left_out":52}
{"sheet":"Council tax","index":8,"n_rows":36,"n_cols":7,"rows_kept":36,"cut":false,"hidden":true,"merged":[]}
[]
[null,"24-25"]
["Annual","Region",null,null,null,"D"]
[null,"North East",null,null,null,2314.7399999999998]
[null,"South West",null,null,null,2298.98]
[null,"East Midlands",null,null,null,2254.79]
[null,"South East",null,null,null,2246.69]
[null,"North West",null,null,null,2239.2600000000002]
[null,"East England",null,null,null,2183.58]
[null,"Yorkshire & the Humber",null,null,null,2163]
[null,"West Midlands",null,null,null,2144.33]
[null,"LONDON",null,null,null,1894.41]
[null,"Wales",null,null,null,1997.55]
[null,"Scotland",null,null,null,1421]
[]
{"$rows_left_out":22}
{"sheet":"Postcodes","index":9,"n_rows":188,"n_cols":9,"rows_kept":188,"cut":false,"hidden":true,"merged":[]}
[]
["POSTCODE","REGION","Band D"]
["AB","Scotland"]
["AL","South East"]
["B1","West Midlands"]
["B1","West Midlands"]
["B2","West Midlands"]
["B3","West Midlands"]
["B4","West Midlands",null,null,null,null,null,"Count of REGION"]
["B5","West Midlands",null,null,null,null,null,"REGION","Total"]
["B6","West Midlands",null,null,null,null,null,"East Midlands",5]
["B7","West Midlands",null,null,null,null,null,"London",44]
["B8","West Midlands",null,null,null,null,null,"North East",5]
["B9","West Midlands",null,null,null,null,null,"North West",31]
["BA","South West",null,null,null,null,null,"Scotland",24]
{"$rows_left_out":174}
{"sheet":"E Calc","index":10,"n_rows":84,"n_cols":13,"rows_kept":84,"cut":false,"hidden":true,"merged":[[87,14,88,14],[132,2,136,8],[1,2,1,5],[68,1,71,8],[87,13,88,13]]}
[]
[null,null,"Affordability Calculator"]
[]
[null,"Loan requirements"]
[null,null,"Mortgage required",{"$f":"Enquiry!E36","v":0}]
[]
[null,null,"Mortgage Term in Years",{"$f":"Enquiry!R22","v":0}]
[]
[null,null,"Repayment type (select from list)",{"$f":"IF(Enquiry!E36=Enquiry!E37,\"Capital Repayment\",IF(Enquiry!E36=Enquiry!K37,\"Interest Only\",IF(Enquiry!E36=Enquiry!E37+Enquiry!K37,\"Part capital repayment/Part interest only\",\"\")))","v":"Capital Repayment"}]
[]
[null,null,"Capital Repayment Amount",{"$f":"Enquiry!E37","v":0}]
[]
[null,null,"Interest Only Amount",{"$f":"Enquiry!K37","v":0}]
[]
[null,null,"Product length (select from list)",{"$f":"Enquiry!K38","v":0}]
{"$rows_left_out":70}
{"sheet":"Tax Calculator","index":11,"n_rows":38,"n_cols":20,"rows_kept":38,"cut":false,"hidden":true,"merged":[[1,1,1,3],[1,6,1,8],[2,11,2,13]]}
[]
[null,"Income Tax (England)",null,null,null,null,"Income Tax (Scotland)"]
[null,"Band","Upper Limit","Rate",null,null,"Band","Upper Limit","Rate",null,null,"National Insurance"]
[null,"Personal Allowance",12570,0,null,null,"Personal Allowance",12570,0,null,null,"Band","Upper Limit","Rate"]
[null,"Basic Rate",50270,0.2,null,null,"Starter rate",15397,0.19,null,null,"Primary threshold",12570,0]
[null,"Higher Rate",125140,0.4,null,null,"Basic rate",27491,0.2,null,null,"Upper earnings limit",50270,0.08]
[null,"Additional Rate",null,0.45,null,null,"Intermediate rate",43662,0.21,null,null,"Additional Rate",null,0.02]
[null,null,null,null,null,null,"Higher rate",75000,0.42]
[null,null,null,null,null,null,"Advanced rate",125140,0.45]
[null,null,null,null,null,null,"Top rate",null,0.48]
[]
[null,null,null,null,"Applicant 1",null,null,null,null,"Applicant 2",null,null,null,null,"Applicant 3",null,null,null,null,"Applicant 4"]
[null,null,null,"Gross Annual Income (After Deductions)",{"$f":"Enquiry!X47+Enquiry!U46","v":0},null,null,null,"Gross Annual Income (After Deductions)",{"$f":"Enquiry!X49+Enquiry!U49","v":0},null,null,null,"Gross Annual Income (After Deductions)",{"$f":"Enquiry!X51+Enquiry!U52","v":0},null,null,null,"Gross Annual Income (After Deductions)",{"$f":"Enquiry!X53+Enquiry!U55","v":0}]
[null,null,null,"Before Deductions",{"$f":"E13+Enquiry!R46","v":0},null,null,null,"Before Deductions",{"$f":"J13+Enquiry!R49","v":0},null,null,null,"Before Deductions",{"$f":"O13+Enquiry!R52","v":0},null,null,null,"Before Deductions",{"$f":"T13+Enquiry!R55","v":0}]
[]
{"$rows_left_out":23}